Reaction Details
TargetDual specificity tyrosine-phosphorylation-regulated kinase 2
LigandBDBM50778
Substrate/Competitorn/a
Meas. Tech.ChEMBL_810201 (CHEMBL2015537)
IC50 1500±n/a nM
Citation Cuny, GDUlyanova, NPPatnaik, DLiu, JFLin, XAuerbach, KRay, SSXian, JGlicksman, MAStein, RLHiggins, JM Structure-activity relationship study of beta-carboline derivatives as haspin kinase inhibitors. Bioorg Med Chem Lett22:2015-9 (2012) 
 
Dual specificity tyrosine-phosphorylation-regulated kinase 2
Name:Dual specificity tyrosine-phosphorylation-regulated kinase 2
Type:PROTEIN
Mol. Mass.:66690.69
Organism:Homo sapiens (Human)
Description:ChEMBL_1508025
Residue:601
BDBM50778
NameBDBM50778
Synonyms:(1S,2S,3R,8aS)-6-acetyl-3-carbamoyl-1-cyano-2-(3-thienyl)-3,8a-dihydro-2H-indolizine-1-carboxylic acid ethyl ester MLS000028120 cid_658017 ethyl (1S,2S,3R,8aS)-6-acetyl-3-carbamoyl-1-cyano-2-thiophen-3-yl-3,8a-dihydro-2H-indolizine-1-carboxylate
TypeSmall organic molecule
Emp. Form.C19H19N3O4S
Mol. Mass.385.437
SMILESCCOC(=O)[C@]1(C#N)[C@@H]2C=CC(=CN2[C@H]([C@@H]1c1ccsc1)C(N)=O)C(C)=O