Reaction Details
TargetSerine/threonine-protein kinase haspin
LigandBDBM50379513
Substrate/Competitorn/a
Meas. Tech.ChEMBL_812377 (CHEMBL2014113)
IC50 4600±n/a nM
Citation Cuny, GDUlyanova, NPPatnaik, DLiu, JFLin, XAuerbach, KRay, SSXian, JGlicksman, MAStein, RLHiggins, JM Structure-activity relationship study of beta-carboline derivatives as haspin kinase inhibitors. Bioorg Med Chem Lett22:2015-9 (2012) 
 
Serine/threonine-protein kinase haspin
Name:Serine/threonine-protein kinase haspin
Type:PROTEIN
Mol. Mass.:88531.28
Organism:Homo sapiens (Human)
Description:ChEMBL_1510616
Residue:798
BDBM50379513
NameBDBM50379513
Synonyms:CHEMBL2012566
TypeSmall organic molecule
Emp. Form.C20H27N3O
Mol. Mass.325.4479
SMILESCc1nccc2c3ccc(OC(C)(C)C)cc3n(CCCCN)c12