Reaction Details
TargetSerine/threonine-protein kinase haspin
LigandBDBM50379518
Substrate/Competitorn/a
Meas. Tech.ChEMBL_812377 (CHEMBL2014113)
IC50 830±n/a nM
Citation Cuny, GDUlyanova, NPPatnaik, DLiu, JFLin, XAuerbach, KRay, SSXian, JGlicksman, MAStein, RLHiggins, JM Structure-activity relationship study of beta-carboline derivatives as haspin kinase inhibitors. Bioorg Med Chem Lett22:2015-9 (2012) 
 
Serine/threonine-protein kinase haspin
Name:Serine/threonine-protein kinase haspin
Type:PROTEIN
Mol. Mass.:88531.28
Organism:Homo sapiens (Human)
Description:ChEMBL_1510616
Residue:798
BDBM50379518
NameBDBM50379518
Synonyms:CHEMBL2012571
TypeSmall organic molecule
Emp. Form.C17H20ClN3O
Mol. Mass.317.813
SMILESCOc1ccc2c3ccnc(C)c3n(CCCCN)c2c1Cl