Reaction Details
TargetSerine/threonine-protein kinase haspin
LigandBDBM50778
Substrate/Competitorn/a
Meas. Tech.ChEMBL_812377 (CHEMBL2014113)
IC50 770±n/a nM
Citation Cuny, GDUlyanova, NPPatnaik, DLiu, JFLin, XAuerbach, KRay, SSXian, JGlicksman, MAStein, RLHiggins, JM Structure-activity relationship study of beta-carboline derivatives as haspin kinase inhibitors. Bioorg Med Chem Lett22:2015-9 (2012) 
 
Serine/threonine-protein kinase haspin
Name:Serine/threonine-protein kinase haspin
Type:PROTEIN
Mol. Mass.:88531.28
Organism:Homo sapiens (Human)
Description:ChEMBL_1510616
Residue:798
BDBM50778
NameBDBM50778
Synonyms:(1S,2S,3R,8aS)-6-acetyl-3-carbamoyl-1-cyano-2-(3-thienyl)-3,8a-dihydro-2H-indolizine-1-carboxylic acid ethyl ester MLS000028120 cid_658017 ethyl (1S,2S,3R,8aS)-6-acetyl-3-carbamoyl-1-cyano-2-thiophen-3-yl-3,8a-dihydro-2H-indolizine-1-carboxylate
TypeSmall organic molecule
Emp. Form.C19H19N3O4S
Mol. Mass.385.437
SMILESCCOC(=O)[C@]1(C#N)[C@@H]2C=CC(=CN2[C@H]([C@@H]1c1ccsc1)C(N)=O)C(C)=O