Reaction Details
TargetNeuropeptide Y receptor type 5
LigandBDBM50379608
Substrate/Competitorn/a
Meas. Tech.ChEMBL_811654 (CHEMBL2014167)
Ki 0.3±n/a nM
Citation Wu, LLu, KPackiarajan, MJubian, VChandrasena, GWolinsky, TCWalker, MW Indolyl and dihydroindolyl N-glycinamides as potent and in vivo active NPY5 antagonists. Bioorg Med Chem Lett22:2167-71 (2012) 
 
Neuropeptide Y receptor type 5
Name:Neuropeptide Y receptor type 5
Type:Enzyme
Mol. Mass.:50746.64
Organism:Homo sapiens (Human)
Description:Q15761
Residue:445
BDBM50379608
NameBDBM50379608
Synonyms:CHEMBL2013020
TypeSmall organic molecule
Emp. Form.C20H28ClN3O3S
Mol. Mass.425.973
SMILESCC(C)S(=O)(=O)NC[C@H]1CC[C@@H](CC1)NC(=O)Cn1ccc2cc(Cl)ccc12