Reaction Details
TargetCannabinoid receptor 1
LigandBDBM50379693
Substrate/Competitorn/a
Meas. Tech.ChEMBL_812048 (CHEMBL2013474)
Ki>10000±n/a nM
Citation Nelson, DWFrost, JMTietje, KRFlorjancic, ASRyther, KCarroll, WADart, MJDaza, AVHooker, BAGrayson, GKFan, YGarrison, TREl-Kouhen, OFYao, BPai, MChandran, PZhu, CHsieh, GCMeyer, MD Synthesis and evaluation of 2-amido-3-carboxamide thiophene CB2 receptor agonists for pain management. Bioorg Med Chem Lett22:2604-8 (2012) 
 
Cannabinoid receptor 1
Name:Cannabinoid receptor 1
Type:G Protein-Coupled Receptor (GPCR)
Mol. Mass.:52868.96
Organism:Homo sapiens (Human)
Description:P21554
Residue:472
BDBM50379693
NameBDBM50379693
Synonyms:CHEMBL2010905
TypeSmall organic molecule
Emp. Form.C19H28N2O3S
Mol. Mass.364.502
SMILESCCCNC(=O)c1c(NC(=O)C2C(C)(C)C2(C)C)sc2COCCc12