Reaction Details
TargetCannabinoid receptor 2
LigandBDBM50379698
Substrate/Competitorn/a
Meas. Tech.ChEMBL_812046 (CHEMBL2013472)
Ki 91.2±n/a nM
Citation Nelson, DWFrost, JMTietje, KRFlorjancic, ASRyther, KCarroll, WADart, MJDaza, AVHooker, BAGrayson, GKFan, YGarrison, TREl-Kouhen, OFYao, BPai, MChandran, PZhu, CHsieh, GCMeyer, MD Synthesis and evaluation of 2-amido-3-carboxamide thiophene CB2 receptor agonists for pain management. Bioorg Med Chem Lett22:2604-8 (2012) 
 
Cannabinoid receptor 2
Name:Cannabinoid receptor 2
Type:G Protein-Coupled Receptor (GPCR)
Mol. Mass.:39690.94
Organism:Homo sapiens (Human)
Description:P34972
Residue:360
BDBM50379698
NameBDBM50379698
Synonyms:CHEMBL2010901
TypeSmall organic molecule
Emp. Form.C22H28N2O4S
Mol. Mass.416.534
SMILESO=C(Nc1sc2COCCc2c1C(=O)N1CCOCC1)C12CC3CC1CC(C2)C3