Reaction Details
TargetCannabinoid receptor 1
LigandBDBM50379694
Substrate/Competitorn/a
Meas. Tech.ChEMBL_812161 (CHEMBL2013665)
IC50 549.54±n/a nM
Citation Nelson, DWFrost, JMTietje, KRFlorjancic, ASRyther, KCarroll, WADart, MJDaza, AVHooker, BAGrayson, GKFan, YGarrison, TREl-Kouhen, OFYao, BPai, MChandran, PZhu, CHsieh, GCMeyer, MD Synthesis and evaluation of 2-amido-3-carboxamide thiophene CB2 receptor agonists for pain management. Bioorg Med Chem Lett22:2604-8 (2012) 
 
Cannabinoid receptor 1
Name:Cannabinoid receptor 1
Type:G Protein-Coupled Receptor (GPCR)
Mol. Mass.:52868.96
Organism:Homo sapiens (Human)
Description:P21554
Residue:472
BDBM50379694
NameBDBM50379694
Synonyms:CHEMBL2010900
TypeSmall organic molecule
Emp. Form.C21H24F2N2O3S
Mol. Mass.422.489
SMILESFC1(F)CN(C1)C(=O)c1c(NC(=O)C23CC4CC2CC(C3)C4)sc2COCCc12