Reaction Details
TargetCannabinoid receptor 2
LigandBDBM50379696
Substrate/Competitorn/a
Meas. Tech.ChEMBL_812046 (CHEMBL2013472)
Ki 1.95±n/a nM
Citation Nelson, DWFrost, JMTietje, KRFlorjancic, ASRyther, KCarroll, WADart, MJDaza, AVHooker, BAGrayson, GKFan, YGarrison, TREl-Kouhen, OFYao, BPai, MChandran, PZhu, CHsieh, GCMeyer, MD Synthesis and evaluation of 2-amido-3-carboxamide thiophene CB2 receptor agonists for pain management. Bioorg Med Chem Lett22:2604-8 (2012) 
 
Cannabinoid receptor 2
Name:Cannabinoid receptor 2
Type:G Protein-Coupled Receptor (GPCR)
Mol. Mass.:39690.94
Organism:Homo sapiens (Human)
Description:P34972
Residue:360
BDBM50379696
NameBDBM50379696
Synonyms:CHEMBL2010902
TypeSmall organic molecule
Emp. Form.C22H30N2O2S
Mol. Mass.386.551
SMILESCCCNC(=O)c1c(NC(=O)C23CC4CC2CC(C3)C4)sc2CCCCc12