Reaction Details
TargetCannabinoid receptor 2
LigandBDBM50379703
Substrate/Competitorn/a
Meas. Tech.ChEMBL_812046 (CHEMBL2013472)
Ki 213.8±n/a nM
Citation Nelson, DWFrost, JMTietje, KRFlorjancic, ASRyther, KCarroll, WADart, MJDaza, AVHooker, BAGrayson, GKFan, YGarrison, TREl-Kouhen, OFYao, BPai, MChandran, PZhu, CHsieh, GCMeyer, MD Synthesis and evaluation of 2-amido-3-carboxamide thiophene CB2 receptor agonists for pain management. Bioorg Med Chem Lett22:2604-8 (2012) 
 
Cannabinoid receptor 2
Name:Cannabinoid receptor 2
Type:G Protein-Coupled Receptor (GPCR)
Mol. Mass.:39690.94
Organism:Homo sapiens (Human)
Description:P34972
Residue:360
BDBM50379703
NameBDBM50379703
Synonyms:CHEMBL2010897
TypeSmall organic molecule
Emp. Form.C20H26N2O3S
Mol. Mass.374.497
SMILESCCNC(=O)c1c(NC(=O)C23CC4CC2CC(C3)C4)sc2COCCc12