Reaction Details
Target5-hydroxytryptamine receptor 2C
LigandBDBM50379811
Substrate/Competitorn/a
Meas. Tech.ChEMBL_809690 (CHEMBL2016001)
Ki 826±n/a nM
Citation Conway, RJValant, CChristopoulos, ARobertson, ADCapuano, BCrosby, IT Synthesis and SAR study of 4-arylpiperidines and 4-aryl-1,2,3,6-tetrahydropyridines as 5-HT2C agonists. Bioorg Med Chem Lett22:2560-4 (2012) 
 
5-hydroxytryptamine receptor 2C
Name:5-hydroxytryptamine receptor 2C
Type:G Protein-Coupled Receptor (GPCR)
Mol. Mass.:51836.79
Organism:Homo sapiens (Human)
Description:P28335
Residue:458
BDBM50379811
NameBDBM50379811
Synonyms:CHEMBL2011554
TypeSmall organic molecule
Emp. Form.C12H14F3N
Mol. Mass.229.2415
SMILESFC(F)(F)c1ccccc1C1CCNCC1