Reaction Details
TargetAromatase
LigandBDBM7461
Substrate/Competitorn/a
Meas. Tech.ChEMBL_811753 (CHEMBL2014374)
IC50 1500±n/a nM
Citation Bonfield, KAmato, EBankemper, TAgard, HSteller, JKeeler, JMRoy, DMcCallum, APaula, SMa, L Development of a new class of aromatase inhibitors: design, synthesis and inhibitory activity of 3-phenylchroman-4-one (isoflavanone) derivatives. Bioorg Med Chem20:2603-13 (2012) 
 
Aromatase
Name:Aromatase
Type:Enzyme
Mol. Mass.:57888.92
Organism:Homo sapiens (Human)
Description:P11511
Residue:503
BDBM7461
NameBDBM7461
Synonyms:5,7-dihydroxy-2-phenyl-4H-chromen-4-one 5,7-dihydroxyflavone chrysin | cid_5281607
TypeSmall organic molecule
Emp. Form.C15H10O4
Mol. Mass.254.2375
SMILESOc1cc(O)c2c(c1)oc(cc2=O)-c1ccccc1