Reaction Details
TargetFructose-bisphosphate aldolase, glycosomal
LigandBDBM50380323
Substrate/Competitorn/a
Meas. Tech.ChEMBL_813853 (CHEMBL2020222)
IC50 2000±n/a nM
Citation Mabiala-Bassiloua, CGArthus-Cartier, GHannaert, VThérisod, HSygusch, JThérisod, M Mannitol Bis-phosphate Based Inhibitors of Fructose 1,6-Bisphosphate Aldolases. ACS Med Chem Lett2:804-808 (2011) 
 
Fructose-bisphosphate aldolase, glycosomal
Name:Fructose-bisphosphate aldolase, glycosomal
Type:PROTEIN
Mol. Mass.:41192.02
Organism:Trypanosoma brucei brucei
Description:ChEMBL_813853
Residue:372
BDBM50380323
NameBDBM50380323
Synonyms:CHEMBL2017785
TypeSmall organic molecule
Emp. Form.C7H18O12P2
Mol. Mass.356.1581
SMILESCO[C@H](COP(O)(O)=O)[C@@H](O)[C@H](O)[C@H](O)COP(O)(O)=O