Reaction Details
TargetFructose-bisphosphate aldolase, glycosomal
LigandBDBM50380327
Substrate/Competitorn/a
Meas. Tech.ChEMBL_813853 (CHEMBL2020222)
IC50 130000±n/a nM
Citation Mabiala-Bassiloua, CGArthus-Cartier, GHannaert, VThérisod, HSygusch, JThérisod, M Mannitol Bis-phosphate Based Inhibitors of Fructose 1,6-Bisphosphate Aldolases. ACS Med Chem Lett2:804-808 (2011) 
 
Fructose-bisphosphate aldolase, glycosomal
Name:Fructose-bisphosphate aldolase, glycosomal
Type:PROTEIN
Mol. Mass.:41192.02
Organism:Trypanosoma brucei brucei
Description:ChEMBL_813853
Residue:372
BDBM50380327
NameBDBM50380327
Synonyms:CHEMBL2017789
TypeSmall organic molecule
Emp. Form.C8H20O12P2
Mol. Mass.370.1847
SMILESCC[C@@](O)(COP(O)(O)=O)[C@@H](O)[C@H](O)[C@H](O)COP(O)(O)=O