Reaction Details
TargetSphingosine 1-phosphate receptor 4
LigandBDBM50361891
Substrate/Competitorn/a
Meas. Tech.ChEMBL_812705 (CHEMBL2019206)
EC50>50000±n/a nM
Citation Pennington, LDSham, KKPickrell, AJHarrington, PEFrohn, MJLanman, BAReed, ABCroghan, MDLee, MRXu, HMcElvain, MXu, YZhang, XFiorino, MHorner, MMorrison, HGArnett, HAFotsch, CWong, MCee, VJ 4-Methoxy-N-[2-(trifluoromethyl)biphenyl-4-ylcarbamoyl]nicotinamide: A Potent and Selective Agonist of S1P1. ACS Med Chem Lett2:752-757 (2011) 
 
Sphingosine 1-phosphate receptor 4
Name:Sphingosine 1-phosphate receptor 4
Type:G Protein-Coupled Receptor (GPCR)
Mol. Mass.:41647.39
Organism:Homo sapiens (Human)
Description:n/a
Residue:384
BDBM50361891
NameBDBM50361891
Synonyms:CHEMBL1938952
TypeSmall organic molecule
Emp. Form.C21H16F3N3O3
Mol. Mass.415.3652
SMILESCOc1ccncc1C(=O)NC(=O)Nc1ccc(-c2ccccc2)c(c1)C(F)(F)F