Reaction Details
TargetBreast cancer type 1 susceptibility protein
LigandBDBM50380349
Substrate/Competitorn/a
Meas. Tech.ChEMBL_812733 (CHEMBL2019951)
Ki 1240±n/a nM
Citation Yuan, ZKumar, EACampbell, SJPalermo, NYKizhake, SMark Glover, JNNatarajan, A Exploiting the P-1 pocket of BRCT domains toward a structure guided inhibitor design. ACS Med Chem Lett2:764-767 (2011) 
 
Breast cancer type 1 susceptibility protein
Name:Breast cancer type 1 susceptibility protein
Type:PROTEIN
Mol. Mass.:207672.68
Organism:Homo sapiens (Human)
Description:ChEMBL_812733
Residue:1863
BDBM50380349
NameBDBM50380349
Synonyms:CHEMBL2017812
TypeSmall organic molecule
Emp. Form.C36H45N6O11P
Mol. Mass.768.7499
SMILESC[C@@H](O)[C@H](NC(=O)[C@@H]1CCCN1C(=O)[C@H](COP(O)(O)=O)NC(=O)[C@H](Cc1ccc2ccccc2c1)NC(C)=O)C(=O)N[C@@H](Cc1ccccc1)C(N)=O