Reaction Details
TargetBreast cancer type 1 susceptibility protein
LigandBDBM50380354
Substrate/Competitorn/a
Meas. Tech.ChEMBL_812733 (CHEMBL2019951)
Ki 500±n/a nM
Citation Yuan, ZKumar, EACampbell, SJPalermo, NYKizhake, SMark Glover, JNNatarajan, A Exploiting the P-1 pocket of BRCT domains toward a structure guided inhibitor design. ACS Med Chem Lett2:764-767 (2011) 
 
Breast cancer type 1 susceptibility protein
Name:Breast cancer type 1 susceptibility protein
Type:PROTEIN
Mol. Mass.:207672.68
Organism:Homo sapiens (Human)
Description:ChEMBL_812733
Residue:1863
BDBM50380354
NameBDBM50380354
Synonyms:CHEMBL2017817
TypeSmall organic molecule
Emp. Form.C32H43N4O10P
Mol. Mass.674.6784
SMILESCC(C)[C@H](NC(=O)[C@@H]1CCCN1C(=O)[C@H](COP(O)(O)=O)NC(=O)CCCc1ccccc1)C(=O)N[C@@H](Cc1ccccc1)C(O)=O