Reaction Details
TargetNucleotide-binding oligomerization domain-containing protein 2
LigandBDBM62246
Substrate/Competitorn/a
Meas. Tech.ChEMBL_812916 (CHEMBL2020291)
IC50 1750±n/a nM
Citation Khan, PMCorrea, RGDivlianska, DBPeddibhotla, SSessions, EHMagnuson, GBrown, BSuyama, EYuan, HMangravita-Novo, AVicchiarelli, MSu, YVasile, SSmith, LHDiaz, PWReed, JCRoth, GP Identification of Inhibitors of NOD1-Induced Nuclear Factor-żB Activation. ACS Med Chem Lett2:780-785 (2011) 
 
Nucleotide-binding oligomerization domain-containing protein 2
Name:Nucleotide-binding oligomerization domain-containing protein 2
Type:PROTEIN
Mol. Mass.:115287.18
Organism:Homo sapiens (Human)
Description:ChEMBL_1454053
Residue:1040
BDBM62246
NameBDBM62246
Synonyms:1-[5-[4-(4-chlorophenyl)piperazin-1-yl]sulfonyl-2-methyl-2,3-dihydroindol-1-yl]ethanone 1-[5-[[4-(4-chlorophenyl)-1-piperazinyl]sulfonyl]-2-methyl-2,3-dihydroindol-1-yl]ethanone cid_15996790
TypeSmall organic molecule
Emp. Form.C21H24ClN3O3S
Mol. Mass.433.952
SMILESCC1Cc2cc(ccc2N1C(C)=O)S(=O)(=O)N1CCN(CC1)c1ccc(Cl)cc1