Reaction Details
TargetNucleotide-binding oligomerization domain-containing protein 2
LigandBDBM59544
Substrate/Competitorn/a
Meas. Tech.ChEMBL_812916 (CHEMBL2020291)
IC50 570±n/a nM
Citation Khan, PMCorrea, RGDivlianska, DBPeddibhotla, SSessions, EHMagnuson, GBrown, BSuyama, EYuan, HMangravita-Novo, AVicchiarelli, MSu, YVasile, SSmith, LHDiaz, PWReed, JCRoth, GP Identification of Inhibitors of NOD1-Induced Nuclear Factor-żB Activation. ACS Med Chem Lett2:780-785 (2011) 
 
Nucleotide-binding oligomerization domain-containing protein 2
Name:Nucleotide-binding oligomerization domain-containing protein 2
Type:PROTEIN
Mol. Mass.:115287.18
Organism:Homo sapiens (Human)
Description:ChEMBL_1454053
Residue:1040
BDBM59544
NameBDBM59544
Synonyms:4-(3,4-Dihydro-1H-isoquinolin-2-ylmethyl)-N-(4-ethoxy-phenyl)-benzamide 4-(3,4-dihydro-1H-isoquinolin-2-ylmethyl)-N-p-phenetyl-benzamide SMR000515367 | cid_1106360
TypeSmall organic molecule
Emp. Form.C25H26N2O2
Mol. Mass.386.4861
SMILESCCOc1ccc(NC(=O)c2ccc(CN3CCc4ccccc4C3)cc2)cc1