Reaction Details
TargetHistone deacetylase 6
LigandBDBM50380388
Substrate/Competitorn/a
Meas. Tech.ChEMBL_812982 (CHEMBL2020396)
IC50 2.49±n/a nM
Citation Kalin, JHButler, KVAkimova, THancock, WWKozikowski, AP Second-generation histone deacetylase 6 inhibitors enhance the immunosuppressive effects of Foxp3+ T-regulatory cells. J Med Chem55:639-51 (2012) 
 
Histone deacetylase 6
Name:Histone deacetylase 6
Type:Chromatin regulator; hydrolase; repressor
Mol. Mass.:131381.51
Organism:Homo sapiens (Human)
Description:Q9UBN7
Residue:1215
BDBM50380388
NameBDBM50380388
Synonyms:CHEMBL2018450
TypeSmall organic molecule
Emp. Form.C19H19N3O2
Mol. Mass.321.3731
SMILESONC(=O)c1ccc(Cn2c3CNCCc3c3ccccc23)cc1