Reaction Details
TargetHistone deacetylase 6
LigandBDBM50380400
Substrate/Competitorn/a
Meas. Tech.ChEMBL_812982 (CHEMBL2020396)
IC50 0.704±n/a nM
Citation Kalin, JHButler, KVAkimova, THancock, WWKozikowski, AP Second-generation histone deacetylase 6 inhibitors enhance the immunosuppressive effects of Foxp3+ T-regulatory cells. J Med Chem55:639-51 (2012) 
 
Histone deacetylase 6
Name:Histone deacetylase 6
Type:Chromatin regulator; hydrolase; repressor
Mol. Mass.:131381.51
Organism:Homo sapiens (Human)
Description:Q9UBN7
Residue:1215
BDBM50380400
NameBDBM50380400
Synonyms:CHEMBL2018301
TypeSmall organic molecule
Emp. Form.C20H20BrN3O2
Mol. Mass.414.296
SMILESCN1CCc2c(C1)c1cc(Br)ccc1n2Cc1ccc(cc1)C(=O)NO