Reaction Details
TargetHistone deacetylase 1
LigandBDBM50380387
Substrate/Competitorn/a
Meas. Tech.ChEMBL_812981 (CHEMBL2020395)
IC50 5180±n/a nM
Citation Kalin, JHButler, KVAkimova, THancock, WWKozikowski, AP Second-generation histone deacetylase 6 inhibitors enhance the immunosuppressive effects of Foxp3+ T-regulatory cells. J Med Chem55:639-51 (2012) 
 
Histone deacetylase 1
Name:Histone deacetylase 1
Type:Enzyme
Mol. Mass.:55090.27
Organism:Homo sapiens (Human)
Description:Q13547
Residue:482
BDBM50380387
NameBDBM50380387
Synonyms:CHEMBL2018451
TypeSmall organic molecule
Emp. Form.C20H21N3O2
Mol. Mass.335.3996
SMILESCN1CCc2c(C1)n(Cc1ccc(cc1)C(=O)NO)c1ccccc21