Reaction Details
TargetHistone deacetylase 1
LigandBDBM50380395
Substrate/Competitorn/a
Meas. Tech.ChEMBL_812981 (CHEMBL2020395)
IC50 15700±n/a nM
Citation Kalin, JHButler, KVAkimova, THancock, WWKozikowski, AP Second-generation histone deacetylase 6 inhibitors enhance the immunosuppressive effects of Foxp3+ T-regulatory cells. J Med Chem55:639-51 (2012) 
 
Histone deacetylase 1
Name:Histone deacetylase 1
Type:Enzyme
Mol. Mass.:55090.27
Organism:Homo sapiens (Human)
Description:Q13547
Residue:482
BDBM50380395
NameBDBM50380395
Synonyms:CHEMBL2018441
TypeSmall organic molecule
Emp. Form.C22H25N3O2
Mol. Mass.363.4528
SMILESCC(C)N1CCc2c(C1)c1ccccc1n2Cc1ccc(cc1)C(=O)NO