Reaction Details
TargetBeta-secretase 1
LigandBDBM50380545
Substrate/Competitorn/a
Meas. Tech.ChEMBL_813122 (CHEMBL2020741)
IC50 2900±n/a nM
Citation Fernández-Bachiller, MIPérez, CMonjas, LRademann, JRodríguez-Franco, MI New tacrine-4-oxo-4H-chromene hybrids as multifunctional agents for the treatment of Alzheimer's disease, with cholinergic, antioxidant, andß-amyloid-reducing properties. J Med Chem55:1303-17 (2012) 
 
Beta-secretase 1
Name:Beta-secretase 1
Type:Protein
Mol. Mass.:55755.10
Organism:Homo sapiens (Human)
Description:P56817
Residue:501
BDBM50380545
NameBDBM50380545
Synonyms:CHEMBL2019046
TypeSmall organic molecule
Emp. Form.C34H41N3O5
Mol. Mass.571.7064
SMILESCOc1cc(O)c2c(c1)oc(cc2=O)C(=O)NCCCCCCCCCCNc1c2CCCCc2nc2ccccc12