Reaction Details
TargetAcetylcholinesterase
LigandBDBM50380541
Substrate/Competitorn/a
Meas. Tech.ChEMBL_813113 (CHEMBL2020732)
IC50 0.30±n/a nM
Citation Fernández-Bachiller, MIPérez, CMonjas, LRademann, JRodríguez-Franco, MI New tacrine-4-oxo-4H-chromene hybrids as multifunctional agents for the treatment of Alzheimer's disease, with cholinergic, antioxidant, andß-amyloid-reducing properties. J Med Chem55:1303-17 (2012) 
 
Acetylcholinesterase
Name:Acetylcholinesterase
Type:Enzyme
Mol. Mass.:67792.70
Organism:Homo sapiens (Human)
Description:P22303
Residue:614
BDBM50380541
NameBDBM50380541
Synonyms:CHEMBL2019032
TypeSmall organic molecule
Emp. Form.C33H38ClN3O3
Mol. Mass.560.126
SMILESClc1ccc2c(NCCCCCCCCCCNC(=O)c3cc(=O)c4ccccc4o3)c3CCCCc3nc2c1