Reaction Details
TargetAcetylcholinesterase
LigandBDBM50380558
Substrate/Competitorn/a
Meas. Tech.ChEMBL_813113 (CHEMBL2020732)
IC50 0.07±n/a nM
Citation Fernández-Bachiller, MIPérez, CMonjas, LRademann, JRodríguez-Franco, MI New tacrine-4-oxo-4H-chromene hybrids as multifunctional agents for the treatment of Alzheimer's disease, with cholinergic, antioxidant, andß-amyloid-reducing properties. J Med Chem55:1303-17 (2012) 
 
Acetylcholinesterase
Name:Acetylcholinesterase
Type:Enzyme
Mol. Mass.:67792.70
Organism:Homo sapiens (Human)
Description:P22303
Residue:614
BDBM50380558
NameBDBM50380558
Synonyms:CHEMBL2019049
TypeSmall organic molecule
Emp. Form.C33H38ClN3O5
Mol. Mass.592.125
SMILESOc1cc(O)c2c(c1)oc(cc2=O)C(=O)NCCCCCCCCCCNc1c2CCCCc2nc2cc(Cl)ccc12