Reaction Details
TargetPlasminogen
LigandBDBM50380621
Substrate/Competitorn/a
Meas. Tech.ChEMBL_813172 (CHEMBL2020838)
Ki 9.4±n/a nM
Citation Saupe, SMSteinmetzer, T A new strategy for the development of highly potent and selective plasmin inhibitors. J Med Chem55:1171-80 (2012) 
 
Plasminogen
Name:Plasminogen
Type:Enzyme
Mol. Mass.:90579.18
Organism:Homo sapiens (Human)
Description:n/a
Residue:810
BDBM50380621
NameBDBM50380621
Synonyms:CHEMBL2016864
TypeSmall organic molecule
Emp. Form.C45H47N7O6S
Mol. Mass.813.963
SMILESNC(=N)c1ccc(CNC(=O)[C@@H]2Cc3ccc(CNC(=O)Cc4ccc(CC(=O)NCc5ccc(C[C@@H](NS(=O)(=O)Cc6ccccc6)C(=O)N2)cc5)cc4)cc3)cc1