Reaction Details
TargetPlasminogen
LigandBDBM50380622
Substrate/Competitorn/a
Meas. Tech.ChEMBL_813172 (CHEMBL2020838)
Ki 9±n/a nM
Citation Saupe, SMSteinmetzer, T A new strategy for the development of highly potent and selective plasmin inhibitors. J Med Chem55:1171-80 (2012) 
 
Plasminogen
Name:Plasminogen
Type:Enzyme
Mol. Mass.:90579.18
Organism:Homo sapiens (Human)
Description:n/a
Residue:810
BDBM50380622
NameBDBM50380622
Synonyms:CHEMBL2016867
TypeSmall organic molecule
Emp. Form.C43H51N9O6S
Mol. Mass.821.987
SMILESNC(=N)c1ccc(CNC(=O)[C@@H]2Cc3ccc(CNC(=O)CN4CCN(CC4)CC(=O)NCc4ccc(C[C@@H](NS(=O)(=O)Cc5ccccc5)C(=O)N2)cc4)cc3)cc1