Reaction Details
TargetPlasminogen
LigandBDBM50380626
Substrate/Competitorn/a
Meas. Tech.ChEMBL_813172 (CHEMBL2020838)
Ki 2.2±n/a nM
Citation Saupe, SMSteinmetzer, T A new strategy for the development of highly potent and selective plasmin inhibitors. J Med Chem55:1171-80 (2012) 
 
Plasminogen
Name:Plasminogen
Type:Enzyme
Mol. Mass.:90579.18
Organism:Homo sapiens (Human)
Description:n/a
Residue:810
BDBM50380626
NameBDBM50380626
Synonyms:CHEMBL2016874
TypeSmall organic molecule
Emp. Form.C32H34N12O4S
Mol. Mass.682.755
SMILESNC(=N)c1ccc(CNC(=O)[C@@H]2Cc3cn(Cc4cccc(Cn5cc(C[C@@H](NS(=O)(=O)Cc6ccccc6)C(=O)N2)nn5)n4)nn3)cc1