Reaction Details
TargetPlasma kallikrein
LigandBDBM50380627
Substrate/Competitorn/a
Meas. Tech.ChEMBL_813173 (CHEMBL2020839)
Ki 67±n/a nM
Citation Saupe, SMSteinmetzer, T A new strategy for the development of highly potent and selective plasmin inhibitors. J Med Chem55:1171-80 (2012) 
 
Plasma kallikrein
Name:Plasma kallikrein
Type:Protein
Mol. Mass.:71391.16
Organism:Homo sapiens (Human)
Description:P03952
Residue:638
BDBM50380627
NameBDBM50380627
Synonyms:CHEMBL2016875
TypeSmall organic molecule
Emp. Form.C32H36N12O5S
Mol. Mass.700.771
SMILESNC(=N)c1ccc(CNC(=O)[C@@H]2Cc3cn(CC4=CCC=C(Cn5cc(C[C@@H](NS(=O)(=O)Cc6ccccc6)C(=O)N2)nn5)N4O)nn3)cc1