Reaction Details
TargetVitamin K-dependent protein C
LigandBDBM50380619
Substrate/Competitorn/a
Meas. Tech.ChEMBL_813176 (CHEMBL2020842)
Ki 0.61±n/a nM
Citation Saupe, SMSteinmetzer, T A new strategy for the development of highly potent and selective plasmin inhibitors. J Med Chem55:1171-80 (2012) 
 
Vitamin K-dependent protein C
Name:Vitamin K-dependent protein C
Type:Enzyme
Mol. Mass.:52067.73
Organism:Homo sapiens (Human)
Description:n/a
Residue:461
BDBM50380619
NameBDBM50380619
Synonyms:CHEMBL2016865
TypeSmall organic molecule
Emp. Form.C38H44N8O6S
Mol. Mass.740.871
SMILES[#7]\[#6](-[#7])=[#7]\[#6]-c1cccc(-[#6]-[#6@H](-[#7]-[#6](=O)-[#6@@H](-[#6]-[#6]-[#6]-c2ccccc2)-[#7]S(=O)(=O)[#6]-c2cccc(c2)-[#6](-[#8])=O)-[#6](=O)-[#7]-[#6]-c2ccc(cc2)-[#6](-[#7])=[#7])c1