Reaction Details
TargetVitamin K-dependent protein C
LigandBDBM50380624
Substrate/Competitorn/a
Meas. Tech.ChEMBL_813176 (CHEMBL2020842)
Ki 90±n/a nM
Citation Saupe, SMSteinmetzer, T A new strategy for the development of highly potent and selective plasmin inhibitors. J Med Chem55:1171-80 (2012) 
 
Vitamin K-dependent protein C
Name:Vitamin K-dependent protein C
Type:Enzyme
Mol. Mass.:52067.73
Organism:Homo sapiens (Human)
Description:n/a
Residue:461
BDBM50380624
NameBDBM50380624
Synonyms:CHEMBL2016871
TypeSmall organic molecule
Emp. Form.C37H39N5O6S
Mol. Mass.681.8
SMILESNC(=N)c1ccc(CNC(=O)[C@@H]2Cc3ccc(OCC=CCOc4ccc(C[C@@H](NS(=O)(=O)Cc5ccccc5)C(=O)N2)cc4)cc3)cc1