Reaction Details
TargetCytochrome P450 2C9
LigandBDBM50380677
Substrate/Competitorn/a
Meas. Tech.ChEMBL_813215 (CHEMBL2020947)
IC50 2300±n/a nM
Citation Mirguet, OLamotte, YDonche, FToum, JGellibert, FBouillot, AGosmini, RNguyen, VLDelannée, DSeal, JBlandel, FBoullay, ABBoursier, EMartin, SBrusq, JMKrysa, GRiou, ATellier, RCostaz, AHuet, PDudit, YTrottet, LKirilovsky, JNicodeme, E From ApoA1 upregulation to BET family bromodomain inhibition: discovery of I-BET151. Bioorg Med Chem Lett22:2963-7 (2012) 
 
Cytochrome P450 2C9
Name:Cytochrome P450 2C9
Type:Enzyme
Mol. Mass.:55636.33
Organism:Homo sapiens (Human)
Description:P11712
Residue:490
BDBM50380677
NameBDBM50380677
Synonyms:CHEMBL2017284
TypeSmall organic molecule
Emp. Form.C23H17F3N4O4
Mol. Mass.470.4007
SMILESCOc1cc2c3n(-c4ccccc4OC(F)(F)F)c(=O)[nH]c3cnc2cc1-c1c(C)noc1C