Reaction Details
TargetCytochrome P450 2C9
LigandBDBM50380682
Substrate/Competitorn/a
Meas. Tech.ChEMBL_813215 (CHEMBL2020947)
IC50 9900±n/a nM
Citation Mirguet, OLamotte, YDonche, FToum, JGellibert, FBouillot, AGosmini, RNguyen, VLDelannée, DSeal, JBlandel, FBoullay, ABBoursier, EMartin, SBrusq, JMKrysa, GRiou, ATellier, RCostaz, AHuet, PDudit, YTrottet, LKirilovsky, JNicodeme, E From ApoA1 upregulation to BET family bromodomain inhibition: discovery of I-BET151. Bioorg Med Chem Lett22:2963-7 (2012) 
 
Cytochrome P450 2C9
Name:Cytochrome P450 2C9
Type:Enzyme
Mol. Mass.:55636.33
Organism:Homo sapiens (Human)
Description:P11712
Residue:490
BDBM50380682
NameBDBM50380682
Synonyms:CHEMBL2017291 | I-BET151 (16)
TypeSmall organic molecule
Emp. Form.C23H21N5O3
Mol. Mass.415.4445
SMILESCOc1cc2c3n([C@H](C)c4ccccn4)c(=O)[nH]c3cnc2cc1-c1c(C)noc1C