Reaction Details
TargetTyrosine-protein phosphatase non-receptor type 1
LigandBDBM50380737
Substrate/Competitorn/a
Meas. Tech.ChEMBL_813440 (CHEMBL2019336)
Ki 7800±n/a nM
Citation Basu, SPrasad, UVBarawkar, DADe, SPalle, VPMenon, SPatel, MThorat, SSingh, UPDas Sarma, KWaman, YNiranjan, SPathade, VGaur, AReddy, SAnsari, S Discovery of novel and potent heterocyclic carboxylic acid derivatives as protein tyrosine phosphatase 1B inhibitors. Bioorg Med Chem Lett22:2843-9 (2012) 
 
Tyrosine-protein phosphatase non-receptor type 1
Name:Tyrosine-protein phosphatase non-receptor type 1
Type:Protein phosphatase
Mol. Mass.:49963.76
Organism:Homo sapiens (Human)
Description:Human recombinant GST-fusion PTP1B (1-435).
Residue:435
BDBM50380737
NameBDBM50380737
Synonyms:CHEMBL2017838
TypeSmall organic molecule
Emp. Form.C26H22N2O3
Mol. Mass.410.4645
SMILESCn1nc(cc1C(O)=O)-c1ccc(CC(C(=O)c2ccccc2)c2ccccc2)cc1