Reaction Details
TargetTyrosine-protein phosphatase non-receptor type 1
LigandBDBM50380745
Substrate/Competitorn/a
Meas. Tech.ChEMBL_813440 (CHEMBL2019336)
Ki 40000±n/a nM
Citation Basu, SPrasad, UVBarawkar, DADe, SPalle, VPMenon, SPatel, MThorat, SSingh, UPDas Sarma, KWaman, YNiranjan, SPathade, VGaur, AReddy, SAnsari, S Discovery of novel and potent heterocyclic carboxylic acid derivatives as protein tyrosine phosphatase 1B inhibitors. Bioorg Med Chem Lett22:2843-9 (2012) 
 
Tyrosine-protein phosphatase non-receptor type 1
Name:Tyrosine-protein phosphatase non-receptor type 1
Type:Protein phosphatase
Mol. Mass.:49963.76
Organism:Homo sapiens (Human)
Description:Human recombinant GST-fusion PTP1B (1-435).
Residue:435
BDBM50380745
NameBDBM50380745
Synonyms:CHEMBL2017844
TypeSmall organic molecule
Emp. Form.C26H19NO6
Mol. Mass.441.4322
SMILESOC(=O)c1onc(c1C(O)=O)-c1ccc(CC(C(=O)c2ccccc2)c2ccccc2)cc1