Reaction Details
TargetTyrosine-protein phosphatase non-receptor type 1
LigandBDBM50380746
Substrate/Competitorn/a
Meas. Tech.ChEMBL_813440 (CHEMBL2019336)
Ki 2400±n/a nM
Citation Basu, SPrasad, UVBarawkar, DADe, SPalle, VPMenon, SPatel, MThorat, SSingh, UPDas Sarma, KWaman, YNiranjan, SPathade, VGaur, AReddy, SAnsari, S Discovery of novel and potent heterocyclic carboxylic acid derivatives as protein tyrosine phosphatase 1B inhibitors. Bioorg Med Chem Lett22:2843-9 (2012) 
 
Tyrosine-protein phosphatase non-receptor type 1
Name:Tyrosine-protein phosphatase non-receptor type 1
Type:Protein phosphatase
Mol. Mass.:49963.76
Organism:Homo sapiens (Human)
Description:Human recombinant GST-fusion PTP1B (1-435).
Residue:435
BDBM50380746
NameBDBM50380746
Synonyms:CHEMBL2017845
TypeSmall organic molecule
Emp. Form.C25H16F3NO4
Mol. Mass.451.394
SMILESOC(=O)c1cc(no1)-c1ccc(CC(C(=O)c2cc(F)cc(F)c2)c2ccc(F)cc2)cc1