Reaction Details
TargetTyrosine-protein phosphatase non-receptor type 1
LigandBDBM50380753
Substrate/Competitorn/a
Meas. Tech.ChEMBL_813440 (CHEMBL2019336)
Ki 400±n/a nM
Citation Basu, SPrasad, UVBarawkar, DADe, SPalle, VPMenon, SPatel, MThorat, SSingh, UPDas Sarma, KWaman, YNiranjan, SPathade, VGaur, AReddy, SAnsari, S Discovery of novel and potent heterocyclic carboxylic acid derivatives as protein tyrosine phosphatase 1B inhibitors. Bioorg Med Chem Lett22:2843-9 (2012) 
 
Tyrosine-protein phosphatase non-receptor type 1
Name:Tyrosine-protein phosphatase non-receptor type 1
Type:Protein phosphatase
Mol. Mass.:49963.76
Organism:Homo sapiens (Human)
Description:Human recombinant GST-fusion PTP1B (1-435).
Residue:435
BDBM50380753
NameBDBM50380753
Synonyms:CHEMBL2017852
TypeSmall organic molecule
Emp. Form.C27H20FN3O5
Mol. Mass.485.4632
SMILESCOc1ccc(cc1)-c1noc(n1)C(Cc1ccc(cc1)-c1cc(on1)C(O)=O)c1ccc(F)cc1