Reaction Details
TargetTyrosine-protein phosphatase non-receptor type 1
LigandBDBM50380754
Substrate/Competitorn/a
Meas. Tech.ChEMBL_813440 (CHEMBL2019336)
Ki 300±n/a nM
Citation Basu, SPrasad, UVBarawkar, DADe, SPalle, VPMenon, SPatel, MThorat, SSingh, UPDas Sarma, KWaman, YNiranjan, SPathade, VGaur, AReddy, SAnsari, S Discovery of novel and potent heterocyclic carboxylic acid derivatives as protein tyrosine phosphatase 1B inhibitors. Bioorg Med Chem Lett22:2843-9 (2012) 
 
Tyrosine-protein phosphatase non-receptor type 1
Name:Tyrosine-protein phosphatase non-receptor type 1
Type:Protein phosphatase
Mol. Mass.:49963.76
Organism:Homo sapiens (Human)
Description:Human recombinant GST-fusion PTP1B (1-435).
Residue:435
BDBM50380754
NameBDBM50380754
Synonyms:CHEMBL2017853
TypeSmall organic molecule
Emp. Form.C27H20ClN3O5
Mol. Mass.501.918
SMILESCOc1ccc(cc1)C(Cc1ccc(cc1)-c1cc(on1)C(O)=O)c1nc(no1)-c1ccc(Cl)cc1