Reaction Details
TargetTyrosine-protein phosphatase non-receptor type 1
LigandBDBM50380755
Substrate/Competitorn/a
Meas. Tech.ChEMBL_813440 (CHEMBL2019336)
Ki 500±n/a nM
Citation Basu, SPrasad, UVBarawkar, DADe, SPalle, VPMenon, SPatel, MThorat, SSingh, UPDas Sarma, KWaman, YNiranjan, SPathade, VGaur, AReddy, SAnsari, S Discovery of novel and potent heterocyclic carboxylic acid derivatives as protein tyrosine phosphatase 1B inhibitors. Bioorg Med Chem Lett22:2843-9 (2012) 
 
Tyrosine-protein phosphatase non-receptor type 1
Name:Tyrosine-protein phosphatase non-receptor type 1
Type:Protein phosphatase
Mol. Mass.:49963.76
Organism:Homo sapiens (Human)
Description:Human recombinant GST-fusion PTP1B (1-435).
Residue:435
BDBM50380755
NameBDBM50380755
Synonyms:CHEMBL2017854
TypeSmall organic molecule
Emp. Form.C26H17F2N3O3S
Mol. Mass.489.493
SMILESOC(=O)c1csc(n1)-c1ccc(CC(c2nc(no2)-c2cccc(F)c2)c2ccc(F)cc2)cc1