Reaction Details
TargetTyrosine-protein phosphatase non-receptor type 1
LigandBDBM50142317
Substrate/Competitorn/a
Meas. Tech.ChEMBL_813440 (CHEMBL2019336)
IC50 120±n/a nM
Citation Basu, SPrasad, UVBarawkar, DADe, SPalle, VPMenon, SPatel, MThorat, SSingh, UPDas Sarma, KWaman, YNiranjan, SPathade, VGaur, AReddy, SAnsari, S Discovery of novel and potent heterocyclic carboxylic acid derivatives as protein tyrosine phosphatase 1B inhibitors. Bioorg Med Chem Lett22:2843-9 (2012) 
 
Tyrosine-protein phosphatase non-receptor type 1
Name:Tyrosine-protein phosphatase non-receptor type 1
Type:Protein phosphatase
Mol. Mass.:49963.76
Organism:Homo sapiens (Human)
Description:Human recombinant GST-fusion PTP1B (1-435).
Residue:435
BDBM50142317
NameBDBM50142317
Synonyms:(2-bromo-4-(3-oxo-2,3-diphenylpropyl)phenyl)difluoromethylphosphonic acid {[2-Bromo-4-(3-oxo-2,3-diphenyl-propyl)-phenyl]-difluoro-methyl}-phosphonic acid
TypeSmall organic molecule
Emp. Form.C22H18BrF2O4P
Mol. Mass.495.25
SMILESOP(O)(=O)C(F)(F)c1ccc(CC(C(=O)c2ccccc2)c2ccccc2)cc1Br