Reaction Details
TargetOxytocin receptor
LigandBDBM50380757
Substrate/Competitorn/a
Meas. Tech.ChEMBL_813468 (CHEMBL2019476)
Ki 4.2±n/a nM
Citation Smith, ALFreeman, SMStehouwer, JSInoue, KVoll, RJYoung, LJGoodman, MM Synthesis and evaluation of C-11, F-18 and I-125 small molecule radioligands for detecting oxytocin receptors. Bioorg Med Chem20:2721-38 (2012) 
 
Oxytocin receptor
Name:Oxytocin receptor
Synonyms:OTR
Type:PROTEIN
Mol. Mass.:28131.82
Organism:Microtus ochrogaster
Description:ChEMBL_813468
Residue:259
BDBM50380757
NameBDBM50380757
Synonyms:CHEMBL2017868
TypeSmall organic molecule
Emp. Form.C31H38IN3O6S
Mol. Mass.707.619
SMILESCS(=O)(=O)N1CCC(CC1)Oc1ccc(CC(=O)N2CCC(CC2)N2C(=O)CCc3ccccc23)c(OC\C=C/I)c1