Reaction Details
TargetVasopressin V2 receptor
LigandBDBM50380759
Substrate/Competitorn/a
Meas. Tech.ChEMBL_813473 (CHEMBL2019481)
Ki 1800±n/a nM
Citation Smith, ALFreeman, SMStehouwer, JSInoue, KVoll, RJYoung, LJGoodman, MM Synthesis and evaluation of C-11, F-18 and I-125 small molecule radioligands for detecting oxytocin receptors. Bioorg Med Chem20:2721-38 (2012) 
 
Vasopressin V2 receptor
Name:Vasopressin V2 receptor
Type:Receptor
Mol. Mass.:40295.28
Organism:Homo sapiens (Human)
Description:P30518
Residue:371
BDBM50380759
NameBDBM50380759
Synonyms:CHEMBL2017869
TypeSmall organic molecule
Emp. Form.C30H38FN3O6S
Mol. Mass.587.703
SMILESCS(=O)(=O)N1CCC(CC1)Oc1ccc(CC(=O)N2CCC(CC2)N2C(=O)CCc3ccccc23)c(OCCF)c1