Reaction Details
TargetAcetylcholinesterase
LigandBDBM50029799
Substrate/Competitorn/a
Meas. Tech.ChEMBL_813756 (CHEMBL2020014)
IC50 23700±n/a nM
Citation Khorana, NChangwichit, KIngkaninan, KUtsintong, M Prospective acetylcholinesterase inhibitory activity of indole and its analogs. Bioorg Med Chem Lett22:2885-8 (2012) 
 
Acetylcholinesterase
Name:Acetylcholinesterase
Type:Enzyme
Mol. Mass.:67792.70
Organism:Homo sapiens (Human)
Description:P22303
Residue:614
BDBM50029799
NameBDBM50029799
Synonyms:7-Methoxy-1-methyl-2,9-dihydro-1H-beta-carboline 7-methoxy-1-methyl-4,9-dihydro-3H-pyrido[3,4-b]indole CHEMBL340807 | HARMALINE
TypeSmall organic molecule
Emp. Form.C13H14N2O
Mol. Mass.214.2631
SMILESCOc1ccc2c3CCN=C(C)c3[nH]c2c1