Reaction Details
TargetRenin
LigandBDBM50380987
Substrate/Competitorn/a
Meas. Tech.ChEMBL_814099 (CHEMBL2020693)
IC50 0.21±n/a nM
Citation Fournier, PAArbour, MCauchon, EChen, AChefson, ADucharme, YFalgueyret, JPGagné, SGrimm, EHan, YHoule, RLacombe, PLévesque, JFMacDonald, DMackay, BMcKay, DPercival, MDRamtohul, YSt-Jacques, RToulmond, S Design and synthesis of potent, isoxazole-containing renin inhibitors. Bioorg Med Chem Lett22:2670-4 (2012) 
 
Renin
Name:Renin
Type:Enzyme
Mol. Mass.:45058.99
Organism:Homo sapiens (Human)
Description:n/a
Residue:406
BDBM50380987
NameBDBM50380987
Synonyms:CHEMBL2017097
TypeSmall organic molecule
Emp. Form.C20H15BrCl2F2N2O2
Mol. Mass.504.152
SMILESO[C@@]1(CCNC[C@@H]1c1onc(c1Br)-c1cccc(Cl)c1Cl)c1ccc(F)c(F)c1