Reaction Details
TargetRenin
LigandBDBM50380991
Substrate/Competitorn/a
Meas. Tech.ChEMBL_814100 (CHEMBL2020694)
IC50 0.6±n/a nM
Citation Fournier, PAArbour, MCauchon, EChen, AChefson, ADucharme, YFalgueyret, JPGagné, SGrimm, EHan, YHoule, RLacombe, PLévesque, JFMacDonald, DMackay, BMcKay, DPercival, MDRamtohul, YSt-Jacques, RToulmond, S Design and synthesis of potent, isoxazole-containing renin inhibitors. Bioorg Med Chem Lett22:2670-4 (2012) 
 
Renin
Name:Renin
Type:Enzyme
Mol. Mass.:45058.99
Organism:Homo sapiens (Human)
Description:n/a
Residue:406
BDBM50380991
NameBDBM50380991
Synonyms:CHEMBL2017102
TypeSmall organic molecule
Emp. Form.C24H24BrF2N3O3
Mol. Mass.520.366
SMILESCC(=O)NCCc1ccccc1-c1onc([C@H]2CNCC[C@]2(O)c2ccc(F)c(F)c2)c1Br