Reaction Details
TargetRenin
LigandBDBM50380980
Substrate/Competitorn/a
Meas. Tech.ChEMBL_814100 (CHEMBL2020694)
IC50 4.5±n/a nM
Citation Fournier, PAArbour, MCauchon, EChen, AChefson, ADucharme, YFalgueyret, JPGagné, SGrimm, EHan, YHoule, RLacombe, PLévesque, JFMacDonald, DMackay, BMcKay, DPercival, MDRamtohul, YSt-Jacques, RToulmond, S Design and synthesis of potent, isoxazole-containing renin inhibitors. Bioorg Med Chem Lett22:2670-4 (2012) 
 
Renin
Name:Renin
Type:Enzyme
Mol. Mass.:45058.99
Organism:Homo sapiens (Human)
Description:n/a
Residue:406
BDBM50380980
NameBDBM50380980
Synonyms:CHEMBL2017108
TypeSmall organic molecule
Emp. Form.C26H29F2N3O4
Mol. Mass.485.523
SMILESCC(O)c1c(noc1-c1ccccc1CCNC(C)=O)[C@H]1CNCC[C@]1(O)c1ccc(F)c(F)c1