Reaction Details
TargetPotassium voltage-gated channel subfamily H member 2
LigandBDBM50380985
Substrate/Competitorn/a
Meas. Tech.ChEMBL_814101 (CHEMBL2020695)
Ki 3400±n/a nM
Citation Fournier, PAArbour, MCauchon, EChen, AChefson, ADucharme, YFalgueyret, JPGagné, SGrimm, EHan, YHoule, RLacombe, PLévesque, JFMacDonald, DMackay, BMcKay, DPercival, MDRamtohul, YSt-Jacques, RToulmond, S Design and synthesis of potent, isoxazole-containing renin inhibitors. Bioorg Med Chem Lett22:2670-4 (2012) 
 
Potassium voltage-gated channel subfamily H member 2
Name:Potassium voltage-gated channel subfamily H member 2
Type:Multi-pass membrane protein
Mol. Mass.:126672.65
Organism:Homo sapiens (Human)
Description:Q12809
Residue:1159
BDBM50380985
NameBDBM50380985
Synonyms:CHEMBL2016937
TypeSmall organic molecule
Emp. Form.C20H16ClF3N2O2
Mol. Mass.408.801
SMILESO[C@@]1(CCNC[C@@H]1c1cc(no1)-c1ccc(F)cc1Cl)c1ccc(F)c(F)c1