Reaction Details
TargetPotassium voltage-gated channel subfamily H member 2
LigandBDBM50380989
Substrate/Competitorn/a
Meas. Tech.ChEMBL_814101 (CHEMBL2020695)
Ki 3900±n/a nM
Citation Fournier, PAArbour, MCauchon, EChen, AChefson, ADucharme, YFalgueyret, JPGagné, SGrimm, EHan, YHoule, RLacombe, PLévesque, JFMacDonald, DMackay, BMcKay, DPercival, MDRamtohul, YSt-Jacques, RToulmond, S Design and synthesis of potent, isoxazole-containing renin inhibitors. Bioorg Med Chem Lett22:2670-4 (2012) 
 
Potassium voltage-gated channel subfamily H member 2
Name:Potassium voltage-gated channel subfamily H member 2
Type:Multi-pass membrane protein
Mol. Mass.:126672.65
Organism:Homo sapiens (Human)
Description:Q12809
Residue:1159
BDBM50380989
NameBDBM50380989
Synonyms:CHEMBL2017099
TypeSmall organic molecule
Emp. Form.C20H15BrCl2F2N2O2
Mol. Mass.504.152
SMILESO[C@@]1(CCNC[C@@H]1c1onc(c1Br)-c1c(Cl)cccc1Cl)c1ccc(F)c(F)c1