Reaction Details
TargetProstaglandin G/H synthase 1
LigandBDBM50381250
Substrate/Competitorn/a
Meas. Tech.ChEMBL_814314 (CHEMBL2019411)
IC50 6400±n/a nM
Citation Özadali, KÖzkanli, FJain, SRao, PPVelázquez-Martínez, CA Synthesis and biological evaluation of isoxazolo[4,5-d]pyridazin-4-(5H)-one analogues as potent anti-inflammatory agents. Bioorg Med Chem20:2912-22 (2012) 
 
Prostaglandin G/H synthase 1
Name:Prostaglandin G/H synthase 1
Type:Protein
Mol. Mass.:68868.60
Organism:Ovis aries (Sheep)
Description:n/a
Residue:600
BDBM50381250
NameBDBM50381250
Synonyms:CHEMBL2018667
TypeSmall organic molecule
Emp. Form.C17H16N6O2S
Mol. Mass.368.413
SMILESCc1noc2c(Cc3ccccc3)nn(Cc3n[nH]c(=S)n3C)c(=O)c12